BDBM50318492 4-Oxononenal::CHEMBL1086447
SMILES CCCCCC(=O)C=CC=O
InChI Key InChIKey=SEPPVOUBHWNCAW-UHFFFAOYSA-N
Data  1 EC50
  Tab Delimited (TSV)   2D SDfile   Computed 3D by Vconf -m prep SDfile
Find this compound or compounds like it in BindingDB:
Activity Spreadsheet -- Enzyme Inhibition Constant Data from BindingDB
Found 1 hit for monomerid = 50318492
TargetTransient receptor potential cation channel subfamily A member 1(Homo sapiens (Human))
Ferrara University
Curated by ChEMBL
LigandPNGBDBM50318492(4-Oxononenal | CHEMBL1086447)
Affinity DataEC50:  1.90E+3nM. Assay description: Activation of human TRPA1 channel
In DepthDetails ArticlePubMed